2016.05.16

INFO Starting nightly build
INFO 2016-05-16 05:30:02.485087
INFO Set 2016.05.16 as current branch
INFO No changes found, but force option enabled
INFO Created changelog for 2016.05.16
INFO Mirrored changelog-2016.05.16.html in 0h 0m 0s
ERROR FAILED: source build/envsetup.sh && lunch tenderloin && make -j32 otapackage, None
ERROR Dumping errors...
ERROR MAKE:
ERROR make: *** [/home/ev_nightlies/marshmallow/out/host/linux-x86/framework/jack.jar] Error 1
ERROR make: *** Deleting file `/home/ev_nightlies/marshmallow/out/host/linux-x86/framework/jack.jar'
ERROR make: *** Waiting for unfinished jobs....
ERROR
ERROR Hopefully that helps
ERROR FAILED: source build/envsetup.sh && lunch hammerhead && make -j32 otapackage, None
ERROR Dumping errors...
ERROR MAKE:
ERROR make[2]: *** [modules] Error 1
ERROR make[1]: *** [sub-make] Error 2
ERROR make[2]: *** [modules_install] Error 1
ERROR make[1]: *** [sub-make] Error 2
ERROR make: *** [/home/ev_nightlies/marshmallow/out/host/linux-x86/framework/jack.jar] Error 1
ERROR make: *** Deleting file `/home/ev_nightlies/marshmallow/out/host/linux-x86/framework/jack.jar'
ERROR make: *** Waiting for unfinished jobs....
ERROR
ERROR Hopefully that helps
ERROR FAILED: source build/envsetup.sh && lunch shamu && make -j32 otapackage, None
ERROR Dumping errors...
ERROR MAKE:
ERROR make[2]: *** [modules] Error 1
ERROR make[1]: *** [sub-make] Error 2
ERROR make[2]: *** [modules_install] Error 1
ERROR make[1]: *** [sub-make] Error 2
ERROR make: *** [/home/ev_nightlies/marshmallow/out/host/linux-x86/framework/jack.jar] Error 1
ERROR make: *** Deleting file `/home/ev_nightlies/marshmallow/out/host/linux-x86/framework/jack.jar'
ERROR make: *** Waiting for unfinished jobs....
ERROR make: *** wait: No child processes. Stop.
ERROR
ERROR Hopefully that helps
INFO Built all targets in 0h 27m 9s
INFO Total run time: 0h 28m 44s