2016.01.18

INFO Starting nightly build
INFO 2016-01-18 00:45:22.631173
INFO Set 2016.01.18 as current branch
INFO No changes found, but force option enabled
INFO Created changelog for 2016.01.18
INFO Mirrored changelog-2016.01.18.html in 0h 0m 0s
ERROR Command '('make', 'clobber')' returned non-zero exit status 2
ERROR FAILED: source build/envsetup.sh && lunch tenderloin && make -j32 otapackage, None
ERROR Dumping errors...
ERROR MAKE:
ERROR make: *** [/home/ev_nightlies/marshmallow/out/host/linux-x86/obj/EXECUTABLES/mkimage_intermediates/import_includes] Error 1
ERROR make: *** Waiting for unfinished jobs....
ERROR make: *** [/home/ev_nightlies/marshmallow/out/target/product/tenderloin/obj/include/libexpat/expat.h] Error 1
ERROR make: *** [/home/ev_nightlies/marshmallow/out/target/product/tenderloin/obj/include/libexpat/expat_external.h] Error 1
ERROR make: *** [/home/ev_nightlies/marshmallow/out/target/product/tenderloin/obj/include/libdrm/xf86drm.h] Error 1
ERROR
ERROR Hopefully that helps
ERROR Command '('make', 'clobber')' returned non-zero exit status 2
ERROR FAILED: source build/envsetup.sh && lunch hammerhead && make -j32 otapackage, None
ERROR Dumping errors...
ERROR MAKE:
ERROR make: *** [/home/ev_nightlies/marshmallow/out/target/product/hammerhead/obj/include/mm-camera-interface/cam_intf.h] Error 1
ERROR make: *** Waiting for unfinished jobs....
ERROR make: *** [/home/ev_nightlies/marshmallow/out/target/product/hammerhead/obj/include/mm-camera-interface/cam_types.h] Error 1
ERROR make: *** [/home/ev_nightlies/marshmallow/out/target/product/hammerhead/obj/include/libexpat/expat.h] Error 1
ERROR
ERROR Hopefully that helps
ERROR Command '('make', 'clobber')' returned non-zero exit status 2
ERROR FAILED: source build/envsetup.sh && lunch shamu && make -j32 otapackage, None
ERROR Dumping errors...
ERROR MAKE:
ERROR make: *** [/home/ev_nightlies/marshmallow/out/target/product/shamu/obj/STATIC_LIBRARIES/libguitwrp_intermediates/twrp] Error 1
ERROR make: *** Waiting for unfinished jobs....
ERROR make: *** [toybox_links] Error 1
ERROR make[2]: *** [outputmakefile] Error 1
ERROR make[2]: *** Waiting for unfinished jobs....
ERROR make[1]: *** [sub-make] Error 2
ERROR make: *** [/home/ev_nightlies/marshmallow/out/target/product/shamu/obj/KERNEL_OBJ/.config] Error 2
ERROR make: *** wait: No child processes. Stop.
ERROR
ERROR Hopefully that helps
INFO Built all targets in 0h 3m 37s
INFO Total run time: 0h 4m 51s
INFO Mirrored scriptlog-2016.01.18.html in 0h 0m 0s
INFO Starting nightly build
INFO 2016-01-18 05:30:02.677441
INFO Set 2016.01.18 as current branch
INFO No changes found, but force option enabled
INFO Created changelog for 2016.01.18
INFO Mirrored changelog-2016.01.18.html in 0h 0m 0s
ERROR Command '('make', 'clobber')' returned non-zero exit status 2
ERROR FAILED: source build/envsetup.sh && lunch tenderloin && make -j32 otapackage, None
ERROR Dumping errors...
ERROR MAKE:
ERROR make: *** [/home/ev_nightlies/marshmallow/out/host/linux-x86/obj/EXECUTABLES/mkimage_intermediates/import_includes] Error 1
ERROR make: *** Waiting for unfinished jobs....
ERROR make: *** [/home/ev_nightlies/marshmallow/out/target/product/tenderloin/obj/include/libexpat/expat.h] Error 1
ERROR make: *** [/home/ev_nightlies/marshmallow/out/target/product/tenderloin/obj/include/libexpat/expat_external.h] Error 1
ERROR
ERROR Hopefully that helps
ERROR Command '('make', 'clobber')' returned non-zero exit status 2
ERROR FAILED: source build/envsetup.sh && lunch hammerhead && make -j32 otapackage, None
ERROR Dumping errors...
ERROR MAKE:
ERROR make: *** [/home/ev_nightlies/marshmallow/out/target/product/hammerhead/obj/include/mm-camera-interface/cam_intf.h] Error 1
ERROR make: *** Waiting for unfinished jobs....
ERROR make: *** [/home/ev_nightlies/marshmallow/out/target/product/hammerhead/obj/include/mm-camera-interface/cam_types.h] Error 1
ERROR make: *** [/home/ev_nightlies/marshmallow/out/target/product/hammerhead/obj/include/libexpat/expat.h] Error 1
ERROR
ERROR Hopefully that helps
ERROR Command '('make', 'clobber')' returned non-zero exit status 2
ERROR FAILED: source build/envsetup.sh && lunch shamu && make -j32 otapackage, None
ERROR Dumping errors...
ERROR MAKE:
ERROR make: *** [/home/ev_nightlies/marshmallow/out/target/product/shamu/obj/STATIC_LIBRARIES/libguitwrp_intermediates/twrp] Error 1
ERROR make: *** Waiting for unfinished jobs....
ERROR make: *** [toybox_links] Error 1
ERROR make[2]: *** [outputmakefile] Error 1
ERROR make[2]: *** Waiting for unfinished jobs....
ERROR make[1]: *** [sub-make] Error 2
ERROR make: *** [/home/ev_nightlies/marshmallow/out/target/product/shamu/obj/KERNEL_OBJ/.config] Error 2
ERROR make: *** wait: No child processes. Stop.
ERROR
ERROR Hopefully that helps
INFO Built all targets in 0h 3m 40s
INFO Total run time: 0h 6m 21s
INFO Mirrored scriptlog-2016.01.18.html in 0h 0m 0s
INFO Starting nightly build
INFO 2016-01-18 14:36:24.511247
INFO Set 2016.01.18 as current branch
INFO No changes found, but force option enabled
INFO Created changelog for 2016.01.18
INFO Mirrored changelog-2016.01.18.html in 0h 0m 0s
ERROR Command '('make', 'clobber')' returned non-zero exit status 2
ERROR FAILED: source build/envsetup.sh && lunch tenderloin && make -j32 otapackage, None
ERROR Dumping errors...
ERROR MAKE:
ERROR make: *** [/home/ev_nightlies/marshmallow/out/host/linux-x86/obj/EXECUTABLES/mkimage_intermediates/import_includes] Error 1
ERROR make: *** Waiting for unfinished jobs....
ERROR make: *** [/home/ev_nightlies/marshmallow/out/target/product/tenderloin/obj/include/libexpat/expat.h] Error 1
ERROR make: *** [/home/ev_nightlies/marshmallow/out/target/product/tenderloin/obj/include/libexpat/expat_external.h] Error 1
ERROR
ERROR Hopefully that helps
ERROR Command '('make', 'clobber')' returned non-zero exit status 2
ERROR FAILED: source build/envsetup.sh && lunch hammerhead && make -j32 otapackage, None
ERROR Dumping errors...
ERROR MAKE:
ERROR make: *** [/home/ev_nightlies/marshmallow/out/target/product/hammerhead/obj/include/mm-camera-interface/cam_intf.h] Error 1
ERROR make: *** Waiting for unfinished jobs....
ERROR make: *** [/home/ev_nightlies/marshmallow/out/target/product/hammerhead/obj/include/mm-camera-interface/cam_types.h] Error 1
ERROR make: *** [/home/ev_nightlies/marshmallow/out/target/product/hammerhead/obj/include/libexpat/expat.h] Error 1
ERROR
ERROR Hopefully that helps
ERROR Command '('make', 'clobber')' returned non-zero exit status 2
ERROR FAILED: source build/envsetup.sh && lunch shamu && make -j32 otapackage, None
ERROR Dumping errors...
ERROR MAKE:
ERROR make: *** [/home/ev_nightlies/marshmallow/out/target/product/shamu/obj/STATIC_LIBRARIES/libguitwrp_intermediates/twrp] Error 1
ERROR make: *** Waiting for unfinished jobs....
ERROR make: *** [toybox_links] Error 1
ERROR make[2]: *** [outputmakefile] Error 1
ERROR make[2]: *** Waiting for unfinished jobs....
ERROR make[1]: *** [sub-make] Error 2
ERROR make: *** [/home/ev_nightlies/marshmallow/out/target/product/shamu/obj/KERNEL_OBJ/.config] Error 2
ERROR make: *** wait: No child processes. Stop.
ERROR
ERROR Hopefully that helps
INFO Built all targets in 0h 3m 33s
INFO Total run time: 0h 6m 0s
INFO Mirrored scriptlog-2016.01.18.html in 0h 0m 0s
INFO Starting nightly build
INFO 2016-01-18 17:54:07.208319
INFO Set 2016.01.18 as current branch
INFO No changes found, but force option enabled
INFO Created changelog for 2016.01.18
INFO Mirrored changelog-2016.01.18.html in 0h 0m 0s
ERROR Command '('make', 'clobber')' returned non-zero exit status 2
INFO Starting nightly build
INFO 2016-01-18 18:03:41.893109
INFO Set 2016.01.18 as current branch
INFO No changes found, but force option enabled
INFO Created changelog for 2016.01.18
INFO Mirrored changelog-2016.01.18.html in 0h 0m 0s
ERROR Command '('make', 'clobber')' returned non-zero exit status 2
ERROR FAILED: source build/envsetup.sh && lunch tenderloin && make -j32 otapackage, None
ERROR Dumping errors...
ERROR MAKE:
ERROR make: *** [/home/ev_nightlies/marshmallow/out/host/linux-x86/obj/EXECUTABLES/mkimage_intermediates/import_includes] Error 1
ERROR make: *** Waiting for unfinished jobs....
ERROR make: *** [/home/ev_nightlies/marshmallow/out/target/product/tenderloin/obj/include/libexpat/expat.h] Error 1
ERROR make: *** [/home/ev_nightlies/marshmallow/out/target/product/tenderloin/obj/include/libexpat/expat_external.h] Error 1
ERROR make: *** [/home/ev_nightlies/marshmallow/out/target/product/tenderloin/obj/include/libdrm/xf86drm.h] Error 1
ERROR
ERROR Hopefully that helps
ERROR Command '('make', 'clobber')' returned non-zero exit status 2
ERROR FAILED: source build/envsetup.sh && lunch hammerhead && make -j32 otapackage, None
ERROR Dumping errors...
ERROR MAKE:
ERROR make: *** [/home/ev_nightlies/marshmallow/out/target/product/hammerhead/obj/include/mm-camera-interface/cam_intf.h] Error 1
ERROR make: *** Waiting for unfinished jobs....
ERROR make: *** [/home/ev_nightlies/marshmallow/out/target/product/hammerhead/obj/include/mm-camera-interface/cam_types.h] Error 1
ERROR make: *** [/home/ev_nightlies/marshmallow/out/target/product/hammerhead/obj/include/libexpat/expat.h] Error 1
ERROR
ERROR Hopefully that helps
ERROR Command '('make', 'clobber')' returned non-zero exit status 2
INFO Starting nightly build
INFO 2016-01-18 18:10:10.873863
INFO Starting nightly build
INFO 2016-01-18 18:11:47.941377
INFO Set 2016.01.18 as current branch
INFO No changes found, but force option enabled
INFO Created changelog for 2016.01.18
INFO Starting nightly build
INFO 2016-01-18 18:21:12.745376
INFO Skipped sync
INFO Starting nightly build
INFO 2016-01-18 18:21:38.185386
INFO Skipped sync
INFO Starting nightly build
INFO 2016-01-18 18:21:39.831238
INFO Skipped sync
ERROR Command '('make', 'clobber')' returned non-zero exit status 2
INFO Starting nightly build
INFO 2016-01-18 18:22:20.690101
INFO Skipped sync
ERROR Command '('make', 'clobber')' returned non-zero exit status 2
ERROR FAILED: source build/envsetup.sh && lunch tenderloin && make -j32 otapackage, mkdir: cannot create directory `/home/ev_nightlies/marshmallow/out/target/product/tenderloin/': Permission denied
/bin/bash: /home/ev_nightlies/marshmallow/out/target/product/tenderloin/clean_steps.mk: No such file or directory
mkdir: cannot create directory `/home/ev_nightlies/marshmallow/out/target/product/tenderloin/': Permission denied
/bin/bash: /home/ev_nightlies/marshmallow/out/host/linux-x86/previous_prebuilt_tools_config.mk: Permission denied
build/core/base_rules.mk:559: warning: overriding commands for target `/home/ev_nightlies/marshmallow/out/target/product/tenderloin/system/bin/fsck_msdos'
device/hp/tenderloin-common/dosfstools/Android.mk:21: warning: ignoring old commands for target `/home/ev_nightlies/marshmallow/out/target/product/tenderloin/system/bin/fsck_msdos'
find: `frameworks/base/docs/html-ndk': No such file or directory
find: `dummy': No such file or directory
find: `dummy': No such file or directory
find: `dummy': No such file or directory
find: `dummy': No such file or directory
find: `dummy': No such file or directory
find: `dummy': No such file or directory
find: `dummy': No such file or directory
mkdir: cannot create directory `/home/ev_nightlies/marshmallow/out/target/product/tenderloin': Permission denied
touch: cannot touch `/home/ev_nightlies/marshmallow/out/target/product/tenderloin/obj/SHARED_LIBRARIES/libaudioalsa_intermediates/export_includes': No such file or directory
mkdir: cannot create directory `/home/ev_nightlies/marshmallow/out/target/product/tenderloin': Permission denied
touch: cannot touch `/home/ev_nightlies/marshmallow/out/target/product/tenderloin/obj/SHARED_LIBRARIES/libacdbloader_intermediates/export_includes': No such file or directory
mkdir: cannot create directory `/home/ev_nightlies/marshmallow/out/target/product/tenderloin': Permission denied
touch: cannot touch `/home/ev_nightlies/marshmallow/out/target/product/tenderloin/obj/SHARED_LIBRARIES/libacdbmapper_intermediates/export_includes': No such file or directory
build/core/copy_headers.mk:15: warning: overriding commands for target `/home/ev_nightlies/marshmallow/out/target/product/tenderloin/obj/include/qcom/display/copybit.h'
build/core/copy_headers.mk:15: warning: ignoring old commands for target `/home/ev_nightlies/marshmallow/out/target/product/tenderloin/obj/include/qcom/display/copybit.h'
build/core/copy_headers.mk:15: warning: overriding commands for target `/home/ev_nightlies/marshmallow/out/target/product/tenderloin/obj/include/qcom/display/copybit_priv.h'
build/core/copy_headers.mk:15: warning: ignoring old commands for target `/home/ev_nightlies/marshmallow/out/target/product/tenderloin/obj/include/qcom/display/copybit_priv.h'
touch: cannot touch `/home/ev_nightlies/marshmallow/out/target/common/obj/APPS/current_overlays.txt': Permission denied
/bin/bash: /home/ev_nightlies/marshmallow/out/target/common/obj/APPS/current_packages.txt: Permission denied
/bin/bash: /home/ev_nightlies/marshmallow/out/target/common/obj/APPS/current_overlays.txt: Permission denied
/bin/bash: /home/ev_nightlies/marshmallow/out/target/common/obj/APPS/current_overlays.txt: Permission denied
/bin/bash: /home/ev_nightlies/marshmallow/out/target/common/obj/APPS/current_overlays.txt: Permission denied
/bin/bash: /home/ev_nightlies/marshmallow/out/target/common/obj/APPS/current_overlays.txt: Permission denied
/bin/bash: /home/ev_nightlies/marshmallow/out/target/common/obj/APPS/current_overlays.txt: Permission denied
/bin/bash: /home/ev_nightlies/marshmallow/out/target/common/obj/APPS/current_overlays.txt: Permission denied
/bin/bash: /home/ev_nightlies/marshmallow/out/target/common/obj/APPS/current_overlays.txt: Permission denied
Traceback (most recent call last):
File "build/tools/diff_package_overlays.py", line 91, in
main(sys.argv)
File "build/tools/diff_package_overlays.py", line 60, in main
current_overlays = load_overlay_config(argv[2])
File "build/tools/diff_package_overlays.py", line 49, in load_overlay_config
f = open(filename)
IOError: [Errno 2] No such file or directory: '/home/ev_nightlies/marshmallow/out/target/common/obj/APPS/current_overlays.txt'
mv: cannot stat `/home/ev_nightlies/marshmallow/out/target/common/obj/APPS/current_overlays.txt': No such file or directory
touch: cannot touch `/home/ev_nightlies/marshmallow/out/target/common/obj/current_aidl_config.mk': Permission denied
/bin/bash: /home/ev_nightlies/marshmallow/out/target/common/obj/current_aidl_config.mk: Permission denied
/bin/bash: /home/ev_nightlies/marshmallow/out/target/common/obj/current_aidl_config.mk: Permission denied
/bin/bash: /home/ev_nightlies/marshmallow/out/target/common/obj/current_aidl_config.mk: Permission denied
/bin/bash: /home/ev_nightlies/marshmallow/out/target/common/obj/current_aidl_config.mk: Permission denied
/bin/bash: /home/ev_nightlies/marshmallow/out/target/common/obj/current_aidl_config.mk: Permission denied
/bin/bash: /home/ev_nightlies/marshmallow/out/target/common/obj/current_aidl_config.mk: Permission denied
/bin/bash: /home/ev_nightlies/marshmallow/out/target/common/obj/current_aidl_config.mk: Permission denied
/bin/bash: /home/ev_nightlies/marshmallow/out/target/common/obj/current_aidl_config.mk: Permission denied
/bin/bash: /home/ev_nightlies/marshmallow/out/target/common/obj/current_aidl_config.mk: Permission denied
/bin/bash: /home/ev_nightlies/marshmallow/out/target/common/obj/current_aidl_config.mk: Permission denied
/bin/bash: /home/ev_nightlies/marshmallow/out/target/common/obj/current_aidl_config.mk: Permission denied
/bin/bash: /home/ev_nightlies/marshmallow/out/target/common/obj/current_aidl_config.mk: Permission denied
/bin/bash: /home/ev_nightlies/marshmallow/out/target/common/obj/current_aidl_config.mk: Permission denied
/bin/bash: /home/ev_nightlies/marshmallow/out/target/common/obj/current_aidl_config.mk: Permission denied
/bin/bash: /home/ev_nightlies/marshmallow/out/target/common/obj/current_aidl_config.mk: Permission denied
/bin/bash: /home/ev_nightlies/marshmallow/out/target/common/obj/current_aidl_config.mk: Permission denied
/bin/bash: /home/ev_nightlies/marshmallow/out/target/common/obj/current_aidl_config.mk: Permission denied
/bin/bash: /home/ev_nightlies/marshmallow/out/target/common/obj/current_aidl_config.mk: Permission denied
/bin/bash: /home/ev_nightlies/marshmallow/out/target/common/obj/current_aidl_config.mk: Permission denied
/bin/bash: /home/ev_nightlies/marshmallow/out/target/common/obj/current_aidl_config.mk: Permission denied
/bin/bash: /home/ev_nightlies/marshmallow/out/target/common/obj/current_aidl_config.mk: Permission denied
/bin/bash: /home/ev_nightlies/marshmallow/out/target/common/obj/current_aidl_config.mk: Permission denied
/bin/bash: /home/ev_nightlies/marshmallow/out/target/common/obj/current_aidl_config.mk: Permission denied
/bin/bash: /home/ev_nightlies/marshmallow/out/target/common/obj/current_aidl_config.mk: Permission denied
/bin/bash: /home/ev_nightlies/marshmallow/out/target/common/obj/current_aidl_config.mk: Permission denied
/bin/bash: /home/ev_nightlies/marshmallow/out/target/common/obj/current_aidl_config.mk: Permission denied
/bin/bash: /home/ev_nightlies/marshmallow/out/target/common/obj/current_aidl_config.mk: Permission denied
mv: cannot stat `/home/ev_nightlies/marshmallow/out/target/common/obj/current_aidl_config.mk': No such file or directory
build/core/Makefile:46: warning: overriding commands for target `/home/ev_nightlies/marshmallow/out/target/product/tenderloin/system/etc/permissions/android.software.live_wallpaper.xml'
build/core/base_rules.mk:559: warning: ignoring old commands for target `/home/ev_nightlies/marshmallow/out/target/product/tenderloin/system/etc/permissions/android.software.live_wallpaper.xml'
device/hp/tenderloin-common/uboot-bootimg.mk:91: We are here.
mkdir: cannot create directory `/home/ev_nightlies/marshmallow/out/host/linux-x86/obj/EXECUTABLES/mkimage_intermediates/': Permission denied
mkdir: cannot create directory `/home/ev_nightlies/marshmallow/out/target/product/tenderloin': Permission denied
make: *** [/home/ev_nightlies/marshmallow/out/host/linux-x86/obj/EXECUTABLES/mkimage_intermediates/import_includes] Error 1
make: *** Waiting for unfinished jobs....
make: *** [/home/ev_nightlies/marshmallow/out/target/product/tenderloin/obj/include/libexpat/expat.h] Error 1
mkdir: cannot create directory `/home/ev_nightlies/marshmallow/out/target/product/tenderloin': Permission denied
make: *** [/home/ev_nightlies/marshmallow/out/target/product/tenderloin/obj/include/libexpat/expat_external.h] Error 1
mkdir: cannot create directory `/home/ev_nightlies/marshmallow/out/target/product/tenderloin': Permission denied
make: *** [/home/ev_nightlies/marshmallow/out/target/product/tenderloin/obj/include/libdrm/xf86drm.h] Error 1

ERROR Dumping errors...
ERROR Hopefully that helps
ERROR Command '('make', 'clobber')' returned non-zero exit status 2
INFO Starting nightly build
INFO 2016-01-18 18:25:25.015200
INFO Skipped sync
INFO Starting nightly build
INFO 2016-01-18 18:30:36.792403
INFO Set 2016.01.18 as current branch
INFO No changes found, but force option enabled
INFO Created changelog for 2016.01.18
INFO Mirrored changelog-2016.01.18.html in 0h 0m 0s
INFO Built tenderloin in 0h 20m 42s
INFO Mirrored ev_tenderloin-6.0.1-nightly-2016.01.18.zip in 0h 0m 7s
INFO Built hammerhead in 0h 21m 57s
INFO Mirrored ev_hammerhead-6.0.1-nightly-2016.01.18.zip in 0h 0m 9s
INFO Built shamu in 0h 25m 32s
INFO Built all targets in 1h 8m 16s
INFO Mirrored ev_shamu-6.0.1-nightly-2016.01.18.zip in 0h 0m 15s
INFO Total run time: 1h 11m 5s